Loading...
Home > Java Install > Java Error 2352

Java Error 2352

Contents

Please Note: Click the [ ] image to expand the troubleshooting instructions for each step below. Reload to refresh your session. OBP replied Oct 19, 2016 at 4:38 AM Loading... Selenium version: SeleniumIDE 1.2.0 OS: OpenSUSE 11.3 Browser: Firefox Brower version: 3.6.18 The trivial compiler error is that Selenium is defined in the method rather than in the class. click site

That said, if NOTHING will install, then I'm guessing you have a corrupted file system and the best remedy would be to completely reformat and reinstall Windows.. If updates are available, click the Install Updates button. Instructions for Windows 8: Hover the cursor in the bottom left of the screen to produce the Start Menu image. Reinstalling Windows will erase everything from your hard drive, allowing you to start again with a fresh system.

Error Java Installer Download Failed

Check the box that says: "Accept License Agreement". If you believe this post is offensive or violates the CNET Forums' Usage policies, you can report it below (this will not automatically remove the post). Post a reply Discussion is locked Flag Permalink You are posting a reply to: Internal Error 2352 when trying to install The posting of advertisements, profanity, or personal attacks is prohibited. They have been able to install by using MajorGeeks http://www.majorgeeks.com/Sun_Java_Runtime_Environment_d4648.html cybertech, Jan 8, 2008 #50 Pete w Thread Starter Joined: Dec 29, 2007 Messages: 29 I have run Activexcheck and

Type "regedit" and hit ENTER. LOG: URL Download Complete: hrStatus:0, hrOSB:800300fd, hrResponseHdr:0, URLhttp://driveragent.com/files/driveragent.cab) LOG: Reporting Code Download Completion: (hr:800300fd (FAILED), CLASSID: e8f628b5..., szCODEhttp://driveragent.com/files/driveragent.cab), MainTypenull), MainExtnull)) Results 1 fatal error(s) were found with your settings. It took a bit longer than 10 minutes, closer to 30, but by the time it was finished my PC worked great again. Java Install Did Not Complete Error 1601 The error is javax.imageio.IIOException: Can't read input file!

Reboot your computer once all Java components are removed. Java Update Did Not Complete Error Code 1601 Tip: Although Disk Cleanup is a wonderful built-in tool, it will not completely clean up all of the temporary files on your computer. Click the Remove button on the right side. Installing the wrong driver, or simply an incompatible version of the right driver, can make your problems even worse.

The good news is that you can often update the device driver to fix the Error 2352 problem. Error Java Installer Unable To Download Can 「持ち込んだ食品を飲食するのは禁止である。」be simplified for a notification board? Sometimes resolving your Runtime Errors problems may be as simple as updating Windows with the latest Service Pack or other patch that Microsoft releases on an ongoing basis. Thank you for helping us maintain CNET's great community.

Java Update Did Not Complete Error Code 1601

I tried reinstalling windows. Download Now: Windows Error Repair Tool *RegCure Pro will repair Windows Error and registry data errors on your PC Compatible with ALL Versions of Windows Including Windows 7 and 8 Posted Error Java Installer Download Failed From the File menu, choose Export. Error Java Installer Internet Connection Settings In most cases, the "Temporary Files" category will occupy the most disk space.

Click here to join today! get redirected here C:\Documents and Settings\Administrator>RegCure Pro.exe Windows Windows Java Internal Error 2352 may caused by some of the following errors Windows Explorer ErrorsJavascript ErrorsHardware MalfunctionError Symptom include:Can not printing fileBlue ScreenIO errorShutdown problemsHttp Please follow these steps to remove older version of Java components and upgrade the application. Don't Worry - I'm here to help you fix it! Java Download Failed Windows 10

Advertisement Recent Posts My laptop screen...? DriverDoc updates all of your PC device drivers, not just those associated with your 2352 error. If you would like to learn more about manual registry editing, please see the links below. http://shpsoftware.com/java-install/java-jdk-error-1606.php Follow the steps in the Wizard to choose a restore point.

Symfora30, Aug 6, 2016, in forum: Virus & Other Malware Removal Replies: 0 Views: 106 Symfora30 Aug 6, 2016 In Progress Laptop not running right, pls help. Cabinet.dll Is Missing Click Programs and Features. Keebellah replied Oct 19, 2016 at 4:38 AM Append query won't append some...

I had a someone who is a professional tech help me tonight and it seems that nothing will install on this computer.

  1. Please reach out to us anytime on social media for more help: Recommendation: Scan your PC for computer errors.
  2. Type "command" in the search box...
  3. Check any item with Java Runtime Environment (JRE or J2SE) in the name.
  4. Tip: If you are positive that your 2352 error is related to a specific Oracle Corporation program, uninstalling and reinstalling your Error 2352-related program will likely be the solution to your
  5. Simply click the links below for your free download.
  6. Solved: PC Running very slow Discussion in 'Virus & Other Malware Removal' started by Pete w, Dec 29, 2007.
  7. The file is then saved with a .reg file extension.
  8. System File Checker will begin scanning for Error 2352 and other system file problems (be patient - the system scan may take a while).
  9. Once that's done, then install Java JRE 6 from the downloaded installer.http://java.sun.com/javase/downloads/index.jspHope this helps.Grif Flag Permalink Reply This was helpful (0) Collapse - This is where I'm at...
  10. READ MORE © CBS Interactive Inc.  /  All Rights Reserved.

I'm not a PC guru by any stretch, but this was a godsend. These malicious intruders can damage, corrupt, or even delete Runtime Errors-related files. Type "update" into the search box and hit ENTER. Cabinet.dll Download Detailed Information: CodeBase: http://driveragent.com/files/driveragent.cab CLSID: {E8F628B5-259A-4734-97EE-BA914D7BE941} Extension: Type: LOG: Reporting Code Download Completion: (hr:800300fd (FAILED), CLASSID: e8f628b5..., szCODEhttp://driveragent.com/files/driveragent.cab), MainTypenull), MainExtnull)) --- Detailed Error Log Follows --- LOG: Download OnStopBinding called (hrStatus

Once reported, our moderators will be notified and the post will be reviewed. Click Programs. You can and should remove all of the tools I requested you to download and/or folders associated with them now. my review here Follow the on-screen directions to complete the uninstallation of your Error 2352-associated program.

SOLUTION Run the Microsoft utility to repair corrupted registry keys that prevents programs from being completely uninstalled or blocking new installations and updates. Nymfor, Jul 16, 2016, in forum: Virus & Other Malware Removal Replies: 18 Views: 611 askey127 Aug 24, 2016 New computer constantly freezes, running horrible overall dakota5369, Jun 30, 2016, in How is the Gold Competency Level Attained? Click the Uninstall button on the top menu ribbon.

© Copyright 2017 shpsoftware.com. All rights reserved.